Target
Death-associated protein kinase 3
Ligand
BDBM50238989
Substrate
Meas. Tech.
ChEMBL_1664714 (CHEMBL4014510)
IC50
12150±n/a nM
Citation
 Wang, SXu, LLu, YTLiu, YFHan, BLiu, TTang, JLi, JWu, JLi, JYYu, LFYang, F Discovery of benzofuran-3(2H)-one derivatives as novel DRAK2 inhibitors that protect islet?-cells from apoptosis. Eur J Med Chem 130:195-208 (2017)  
Target
Name:
Death-associated protein kinase 3
Synonyms:
DAP kinase 3 DAPK3 ZIP-kinase | ZIPK
Type:
PROTEIN
Mol. Mass.:
52537.07
Organism:
Homo sapiens (Human)
Description:
ChEMBL_586564
Residue:
454
  
Inhibitor
Name:
BDBM50238989
Synonyms:
CHEMBL4087337
Type:
Small organic molecule
Emp. Form.:
C16H12O5
Mol. Mass.:
284.2635
SMILES:
COc1ccc2O\C(=C/c3ccc(O)c(O)c3)C(=O)c2c1
: