Target
Hexokinase-4
Ligand
BDBM50239043
Substrate
Meas. Tech.
ChEMBL_1664958 (CHEMBL4014754)
EC50
4.8±n/a nM
Citation
 Xu, JLin, SMyers, RWAddona, GBerger, JPCampbell, BChen, HSChen, ZEiermann, GJElowe, NHFarrer, BTFeng, WFu, QKats-Kagan, RKavana, MMalkani, SMcMasters, DRMitra, KPachanski, MJTong, XTrujillo, MEXu, LZhang, BZhang, FZhang, RParmee, ER Novel, highly potent systemic glucokinase activators for the treatment of Type 2 Diabetes Mellitus. Bioorg Med Chem Lett 27:2069-2073 (2017)  
Target
Name:
Hexokinase-4
Synonyms:
GCK Glucokinase (GK) HK IV HXK4_HUMAN Hexokinase-D
Type:
Enzyme
Mol. Mass.:
52175.81
Organism:
Homo sapiens (Human)
Description:
P35557
Residue:
465
  
Inhibitor
Name:
BDBM50239043
Synonyms:
CHEMBL4067037
Type:
Small organic molecule
Emp. Form.:
C28H24F3N3O4
Mol. Mass.:
523.5031
SMILES:
CCOC(=O)c1ccc(Oc2cc3cc([nH]c3cc2C2CCC(=O)N2C)-c2ccc(cn2)C(F)(F)F)cc1
: