Target
Hexokinase-4
Ligand
BDBM50239044
Substrate
Meas. Tech.
ChEMBL_1664960 (CHEMBL4014756)
EC50
3.4±n/a nM
Citation
 Xu, JLin, SMyers, RWAddona, GBerger, JPCampbell, BChen, HSChen, ZEiermann, GJElowe, NHFarrer, BTFeng, WFu, QKats-Kagan, RKavana, MMalkani, SMcMasters, DRMitra, KPachanski, MJTong, XTrujillo, MEXu, LZhang, BZhang, FZhang, RParmee, ER Novel, highly potent systemic glucokinase activators for the treatment of Type 2 Diabetes Mellitus. Bioorg Med Chem Lett 27:2069-2073 (2017)  
Target
Name:
Hexokinase-4
Synonyms:
GCK Glucokinase (GK) HK IV HXK4_HUMAN Hexokinase-D
Type:
Enzyme
Mol. Mass.:
52175.81
Organism:
Homo sapiens (Human)
Description:
P35557
Residue:
465
  
Inhibitor
Name:
BDBM50239044
Synonyms:
CHEMBL4104680
Type:
Small organic molecule
Emp. Form.:
C26H24N4O6S
Mol. Mass.:
520.557
SMILES:
COC(=O)c1ccc(nc1)-c1cc2cc(Oc3ccc(nc3)S(C)(=O)=O)c(cc2[nH]1)C1CCC(=O)N1C
: