Target
Hexokinase-4
Ligand
BDBM50239046
Substrate
Meas. Tech.
ChEMBL_1664960 (CHEMBL4014756)
EC50
9.8±n/a nM
Citation
 Xu, JLin, SMyers, RWAddona, GBerger, JPCampbell, BChen, HSChen, ZEiermann, GJElowe, NHFarrer, BTFeng, WFu, QKats-Kagan, RKavana, MMalkani, SMcMasters, DRMitra, KPachanski, MJTong, XTrujillo, MEXu, LZhang, BZhang, FZhang, RParmee, ER Novel, highly potent systemic glucokinase activators for the treatment of Type 2 Diabetes Mellitus. Bioorg Med Chem Lett 27:2069-2073 (2017)  
Target
Name:
Hexokinase-4
Synonyms:
GCK Glucokinase (GK) HK IV HXK4_HUMAN Hexokinase-D
Type:
Enzyme
Mol. Mass.:
52175.81
Organism:
Homo sapiens (Human)
Description:
P35557
Residue:
465
  
Inhibitor
Name:
BDBM50239046
Synonyms:
CHEMBL4068048
Type:
Small organic molecule
Emp. Form.:
C27H28N4O5S
Mol. Mass.:
520.6
SMILES:
CN1C(CCC1=O)c1cc2[nH]c(cc2cc1Oc1ccc(nc1)S(C)(=O)=O)-c1ccc(cn1)C(C)(C)O
: