Target
Protein kinase C alpha type
Ligand
BDBM3199
Substrate
Lysine-rich histone
Meas. Tech.
PKC assay
IC50
30±n/a nM
Citation
 Defauw, JMMurphy, MMJagdmann, GEHu, HLampe, JWHollinshead, SPMitchell, TJCrane, HMHeerding, JMMendoza, JSDavis, JEDarges, JWHubbard, FRHall, SE Synthesis and protein kinase C inhibitory activities of acyclic balanol analogs that are highly selective for protein kinase C over protein kinase A. J Med Chem 39:5215-27 (1996)  
Target
Name:
Protein kinase C alpha type
Synonyms:
KPCA_HUMAN PKC alpha and beta-2 PKC-alpha PRKACA Protein Kinase C- alpha Protein kinase C alpha (PKCa) Protein kinase C alpha type (PRKCA) RAF proto-oncogene serine/threonine-protein kinase
Type:
Enzyme
Mol. Mass.:
76755.65
Organism:
Homo sapiens (Human)
Description:
The recombinant human PKC enzymes were produced using a baculovirus expression system in SF9 cells
Residue:
672
  
Inhibitor
Name:
BDBM3199
Synonyms:
(+-)-anti-2-[[2,6-Dihydroxy-4-[[[2-(4-hydroxybenzyl)cyclopentyl]oxy]carbonyl]phenyl]carbonyl]-3-hydroxybenzoic acid Acyclic Balanol Analog 29b
Type:
Small organic molecule
Emp. Form.:
C27H24O9
Mol. Mass.:
492.4741
SMILES:
OC(=O)c1cccc(O)c1C(=O)c1c(O)cc(cc1O)C(=O)O[C@@H]1CCC[C@H]1Cc1ccc(O)cc1
:
Substrate
Name:
Lysine-rich histone
Synonyms:
ING Peptide histone type IIIS
Type:
Peptide
Mol. Mass.:
10508.21
Organism:
Bos taurus (bovine)
Description:
Purified as a lysine rich fraction of histone H1 from calf thymus.
Residue:
105