Target
Gamma-aminobutyric acid receptor subunit alpha-6
Ligand
BDBM50034816
Substrate
Ki
8.2±n/a nM
Comments
PDSP_1994
Citation
 Gunnersen, DKaufman, CMSkolnick, P Pharmacological properties of recombinant "diazepam-insensitive" GABAA receptors. Neuropharmacology 35:1307-14 (1996)  
Target
Name:
Gamma-aminobutyric acid receptor subunit alpha-6
Synonyms:
GABA A Alpha6Beta3Gamma2 GABA receptor alpha-6 subunit Gabra-6 Gamma-aminobutyric acid receptor subunit alpha-6
Type:
Enzyme Catalytic Domain
Mol. Mass.:
51188.24
Organism:
RAT
Description:
GABA A Alpha6Beta2Gamma2 0 RAT::P30191
Residue:
453
  
Inhibitor
Name:
BDBM50034816
Synonyms:
8-Chloro-5-methyl-6-oxo-5,6-dihydro-4H-2,5,10b-triaza-benzo[e]azulene-3-carboxylic acid tert-butyl ester ZG 63
Type:
Small organic molecule
Emp. Form.:
C17H18ClN3O3
Mol. Mass.:
347.796
SMILES:
CN1Cc2c(ncn2-c2ccc(Cl)cc2C1=O)C(=O)OC(C)(C)C
: