Target
Metabotropic glutamate receptor 8
Ligand
BDBM50004051
Substrate
Ki
400±n/a nM
Comments
PDSP_2029
Citation
 Conn, PJPin, JP Pharmacology and functions of metabotropic glutamate receptors. Annu Rev Pharmacol Toxicol 37:205-37 (1997)  
Target
Name:
Metabotropic glutamate receptor 8
Synonyms:
GPRC1H GRM8_HUMAN Metabotropic glutamate receptor 8 | metabotropic glutamate 8
Type:
Enzyme Catalytic Domain
Mol. Mass.:
101759.58
Organism:
Homo sapiens (Human)
Description:
metabotropic glutamate 8 GRM8 HUMAN::O00222
Residue:
908
  
Inhibitor
Name:
BDBM50004051
Synonyms:
2-Amino-4-phosphono-butyric acid 4-Amino Phosphonobutyrate GlcN-6-P synthase inhibitor, 1 (racemic mixture) | L-AP4
Type:
Small organic molecule
Emp. Form.:
C4H10NO5P
Mol. Mass.:
183.0997
SMILES:
NC(CCP(O)(O)=O)C(O)=O
: