Target
Protein kinase C epsilon type
Ligand
BDBM3244
Substrate
Histone type HL
Meas. Tech.
PKC assay
pH
7.5±n/a
Temperature
303.15±n/a K
IC50
1300±n/a nM
Citation
 Crane, HMMenaldino, DSJagdmann, GEDarges, JWBuben, JA Increasing the cellular PKC inhibitory activity of balanol: a study of ester analogs. Bioorg Med Chem Lett 5:2133-8 (1995)    Article 
Target
Name:
Protein kinase C epsilon type
Synonyms:
KPCE_HUMAN PKCE Protein kinase C epsilon Protein kinase C, PKC; classical/novel nPKC-epsilon
Type:
Enzyme
Mol. Mass.:
83680.45
Organism:
Homo sapiens (Human)
Description:
The recombinant human PKC enzymes were produced using a baculovirus expression system in SF9 cells
Residue:
737
  
Inhibitor
Name:
BDBM3244
Synonyms:
(3R,4R)-4-[(4-hydroxybenzene)amido]pyrrolidin-3-yl 4-{[2-(ethoxycarbonyl)-6-hydroxyphenyl]carbonyl}-3,5-dihydroxybenzoate | Balanol Benzophenone Ester Analog 25
Type:
Small organic molecule
Emp. Form.:
C28H26N2O10
Mol. Mass.:
550.5134
SMILES:
CCOC(=O)c1cccc(O)c1C(=O)c1c(O)cc(cc1O)C(=O)O[C@@H]1CNC[C@H]1NC(=O)c1ccc(O)cc1
:
Substrate
Name:
Histone type HL
Synonyms:
Type:
Peptide
Mol. Mass.:
358.43
Organism:
Description:
unfractionated histone (Worthington) 30 uM [gamma-32P]ATP as co-substrate.
Residue:
3
NA