Target
Alpha-2A adrenergic receptor
Ligand
BDBM85231
Substrate
Ki
6025.60±n/a nM
Comments
PDSP_5984
Citation
 Jasper, JRLesnick, JDChang, LKYamanishi, SSChang, TKHsu, SADaunt, DABonhaus, DWEglen, RM Ligand efficacy and potency at recombinant alpha2 adrenergic receptors: agonist-mediated [35S]GTPgammaS binding. Biochem Pharmacol 55:1035-43 (1998)  
Target
Name:
Alpha-2A adrenergic receptor
Synonyms:
ADA2A_HUMAN ADRA2R Adrenergic alpha2A Alpha-2 adrenergic receptor subtype C10 Alpha-2A adrenoreceptor alpha-2A adrenergic receptor [Homo sapiens]
Type:
Enzyme
Mol. Mass.:
48979.91
Organism:
Homo sapiens (Human)
Description:
P08913
Residue:
465
  
Inhibitor
Name:
BDBM85231
Synonyms:
Alinidine | CAS_33178-86-8
Type:
Small organic molecule
Emp. Form.:
C12H13Cl2N3
Mol. Mass.:
270.158
SMILES:
Clc1cccc(Cl)c1N(CC=C)C1=NCCN1
: