Target
Alpha-2A adrenergic receptor
Ligand
BDBM30703
Substrate
Ki
15.14±n/a nM
Comments
PDSP_2767
Citation
 Jasper, JRLesnick, JDChang, LKYamanishi, SSChang, TKHsu, SADaunt, DABonhaus, DWEglen, RM Ligand efficacy and potency at recombinant alpha2 adrenergic receptors: agonist-mediated [35S]GTPgammaS binding. Biochem Pharmacol 55:1035-43 (1998)  
Target
Name:
Alpha-2A adrenergic receptor
Synonyms:
ADA2A_HUMAN ADRA2R Adrenergic alpha2A Alpha-2 adrenergic receptor subtype C10 Alpha-2A adrenoreceptor alpha-2A adrenergic receptor [Homo sapiens]
Type:
Enzyme
Mol. Mass.:
48979.91
Organism:
Homo sapiens (Human)
Description:
P08913
Residue:
465
  
Inhibitor
Name:
BDBM30703
Synonyms:
2-(4-tert-butyl-2,6-dimethyl-benzyl)-2-imidazoline;hydrochloride 2-[(4-tert-butyl-2,6-dimethylphenyl)methyl]-4,5-dihydro-1H-imidazole;hydrochloride MLS000069695 XYLOMETAZOLINE HYDROCHLORIDE cid_5282386
Type:
Small organic molecule
Emp. Form.:
C16H24N2
Mol. Mass.:
244.3752
SMILES:
Cc1cc(cc(C)c1CC1=NCCN1)C(C)(C)C
: