Target
Alpha-2B adrenergic receptor
Ligand
BDBM85231
Substrate
Ki
6456.54±n/a nM
Comments
PDSP_5984
Citation
 Jasper, JRLesnick, JDChang, LKYamanishi, SSChang, TKHsu, SADaunt, DABonhaus, DWEglen, RM Ligand efficacy and potency at recombinant alpha2 adrenergic receptors: agonist-mediated [35S]GTPgammaS binding. Biochem Pharmacol 55:1035-43 (1998)  
Target
Name:
Alpha-2B adrenergic receptor
Synonyms:
ADA2B_HUMAN ADRA2L1 Adrenergic alpha2B Adrenergic receptor alpha Alpha-2 adrenergic receptor subtype C2 Alpha-2B adrenoreceptor | Alpha-2BAR
Type:
Enzyme
Mol. Mass.:
49964.20
Organism:
Homo sapiens (Human)
Description:
P18089
Residue:
450
  
Inhibitor
Name:
BDBM85231
Synonyms:
Alinidine | CAS_33178-86-8
Type:
Small organic molecule
Emp. Form.:
C12H13Cl2N3
Mol. Mass.:
270.158
SMILES:
Clc1cccc(Cl)c1N(CC=C)C1=NCCN1
: