Target
Alpha-2C adrenergic receptor
Ligand
BDBM81926
Substrate
Ki
21.38±n/a nM
Comments
PDSP_1437
Citation
 Jasper, JRLesnick, JDChang, LKYamanishi, SSChang, TKHsu, SADaunt, DABonhaus, DWEglen, RM Ligand efficacy and potency at recombinant alpha2 adrenergic receptors: agonist-mediated [35S]GTPgammaS binding. Biochem Pharmacol 55:1035-43 (1998)  
Target
Name:
Alpha-2C adrenergic receptor
Synonyms:
ADA2C_HUMAN ADRA2L2 Adrenergic alpha2C Adrenergic receptor alpha Alpha-2 adrenergic receptor subtype C4 Alpha-2C adrenoreceptor | adrenergic, alpha-2C-, receptor [Homo sapiens]
Type:
Enzyme
Mol. Mass.:
49552.32
Organism:
Homo sapiens (Human)
Description:
P18825
Residue:
462
  
Inhibitor
Name:
BDBM81926
Synonyms:
Aminoclonidine, p NSC_51763 | p-AMINOCLONIDINE
Type:
Small organic molecule
Emp. Form.:
C9H10Cl2N4
Mol. Mass.:
245.109
SMILES:
Nc1cc(Cl)c(NC2=NCCN2)c(Cl)c1
: