Target
Delta-type opioid receptor
Ligand
BDBM50013388
Substrate
Ki
0.9±n/a nM
Comments
PDSP_414
Citation
 Toll, LBerzetei-Gurske, IPPolgar, WEBrandt, SRAdapa, IDRodriguez, LSchwartz, RWHaggart, DO'Brien, AWhite, AKennedy, JMCraymer, KFarrington, LAuh, JS Standard binding and functional assays related to medications development division testing for potential cocaine and opiate narcotic treatment medications. NIDA Res Monogr 178:440-66 (1998) Target
Name:
Delta-type opioid receptor
Synonyms:
D-OR-1 Delta opioid receptor OPIATE Delta OPRD1 OPRK1 | opioid receptor, delta 1
Type:
G Protein-Coupled Receptor (GPCR)
Mol. Mass.:
40382.98
Organism:
Homo sapiens (Human)
Description:
Competition binding assays were carried out using membrane preparations from transfected HN9.10 cells that constitutively expressed the delta opioid receptor.
Residue:
372
  
Inhibitor
Name:
BDBM50013388
Synonyms:
6-Ethyl-3-(1-hydroxy-cyclopropylmethyl)-11,11-dimethyl-1,2,3,4,5,6-hexahydro-2,6-methano-benzo[d]azocin-8-ol Bremazocine | CHEMBL350384
Type:
Small organic molecule
Emp. Form.:
C20H29NO2
Mol. Mass.:
315.4498
SMILES:
CCC12CCN(CC3(O)CC3)C(Cc3ccc(O)cc13)C2(C)C
: