Target
5-hydroxytryptamine receptor 7
Ligand
BDBM82087
Substrate
Ki
0.25±n/a nM
Comments
PDSP_172
Citation
 Hemedah, MCoupar, IMMitchelson, FJ [3H]-Mesulergine labels 5-HT7 sites in rat brain and guinea-pig ileum but not rat jejunum. Br J Pharmacol 126:179-88 (1999)  
Target
Name:
5-hydroxytryptamine receptor 7
Synonyms:
5-HT7 5HT7R_CAVPO Serotonin 7 (5-HT7) receptor
Type:
Enzyme Catalytic Domain
Mol. Mass.:
49632.36
Organism:
GUINEA PIG
Description:
5-HT7 HTR7 GUINEA PIG::P50407
Residue:
446
  
Inhibitor
Name:
BDBM82087
Synonyms:
2-(5-methoxy-1H-indol-3-yl)ethanamine 5-Methoxytryptamine hydrochloride tryptamine, 5-Methoxy
Type:
Small organic molecule
Emp. Form.:
C11H14N2O
Mol. Mass.:
190.2417
SMILES:
COc1ccc2[nH]cc(CCN)c2c1
: