Target
Bombesin
Ligand
BDBM85501
Substrate
Ki
2243±n/a nM
Comments
PDSP_749
Citation
 Katsuno, TPradhan, TKRyan, RRMantey, SAHou, WDonohue, PJAkeson, MASpindel, ERBattey, JFCoy, DHJensen, RT Pharmacology and cell biology of the bombesin receptor subtype 4 (BB4-R). Biochemistry 38:7307-20 (1999)  
Target
Name:
Bombesin
Synonyms:
BOMB_BOMVA | Bombesin 4
Type:
Enzyme Catalytic Domain
Mol. Mass.:
12340.04
Organism:
Frog
Description:
Bombesin 4 0 Frog::P84213
Residue:
107
  
Inhibitor
Name:
BDBM85501
Synonyms:
DPhe6-Bn(6-13)hydrazide
Type:
Small organic molecule
Emp. Form.:
C47H66N14O9
Mol. Mass.:
971.1153
SMILES:
CC(C)C[C@H](NC(=O)[C@H](Cc1cnc[nH]1)NC(=O)CNC(=O)[C@@H](NC(=O)[C@H](C)NC(=O)[C@H](Cc1c[nH]c2ccccc12)NC(=O)[C@H](CCC(N)=O)NC(=O)[C@H](N)Cc1ccccc1)C(C)C)C(=O)NN
: