Target
Metabotropic glutamate receptor 8
Ligand
BDBM50030627
Substrate
Ki
>10000±n/a nM
Comments
PDSP_2028
Citation
 Naples, MAHampson, DR Pharmacological profiles of the metabotropic glutamate receptor ligands. Neuropharmacology 40:170-7 (2001)  
Target
Name:
Metabotropic glutamate receptor 8
Synonyms:
GRM8_RAT Grm8 Metabotropic glutamate receptor 8 (mGlu8) glutamate receptor, metabotropic 8 precursor metabotropic glutamate 8
Type:
Enzyme
Mol. Mass.:
101886.18
Organism:
Rattus norvegicus (Rat)
Description:
P70579
Residue:
908
  
Inhibitor
Name:
BDBM50030627
Synonyms:
(+-)-MCPG 4-(1-Amino-1-carboxy-ethyl)-benzoic acid CHEMBL299683 | MCPG
Type:
Small organic molecule
Emp. Form.:
C10H11NO4
Mol. Mass.:
209.1986
SMILES:
CC(N)(C(O)=O)c1ccc(cc1)C(O)=O
: