Target
Vasoactive intestinal polypeptide receptor 1
Ligand
BDBM50122872
Substrate
Ki
>10000±n/a nM
Comments
PDSP_1544
Citation
 Briejer, MRBosmans, JPVan Daele, PJurzak, MHeylen, LLeysen, JEPrins, NHSchuurkes, JA The in vitro pharmacological profile of prucalopride, a novel enterokinetic compound. Eur J Pharmacol 423:71-83 (2001)  
Target
Name:
Vasoactive intestinal polypeptide receptor 1
Synonyms:
VIP 1 VIPR1_HUMAN | Vasoactive intestinal polypeptide receptor 1
Type:
Enzyme Catalytic Domain
Mol. Mass.:
51557.18
Organism:
Homo sapiens (Human)
Description:
VIP 1 VIPR1 0::P32241
Residue:
457
  
Inhibitor
Name:
BDBM50122872
Synonyms:
4-Amino-5-chloro-2,3-dihydro-benzofuran-7-carboxylic acid [1-(3-methoxy-propyl)-piperidin-4-yl]-amide PRUCALOPRIDE | US9663465, prucalopride
Type:
Small organic molecule
Emp. Form.:
C18H26ClN3O3
Mol. Mass.:
367.87
SMILES:
COCCCN1CCC(CC1)NC(=O)c1cc(Cl)c(N)c2CCOc12
: