Target
Serine/threonine-protein kinase TBK1
Ligand
BDBM276854
Substrate
Meas. Tech.
Biological Assay for TBK1 and IKKs
pH
7±n/a
IC50
7.98±n/a nM
Comments
extracted
Citation
 Du, ZGuerrero, JAKaplan, JAKnox, Jr., JENaduthambi, DPhillips, BWVenkataramani, CWang, PWatkins, WJZablocki, J Tank-binding kinase inhibitor compounds US Patent  US10072001 Publication Date 9/11/2018 
Target
Name:
Serine/threonine-protein kinase TBK1
Synonyms:
NAK Protein cereblon/Serine/threonine-protein kinase TBK1 TANK-binding kinase 1 (TBK-1) TBK1 | TBK1_HUMAN
Type:
protein
Mol. Mass.:
83645.20
Organism:
Homo sapiens (Human)
Description:
Q9UHD2
Residue:
729
  
Inhibitor
Name:
BDBM276854
Synonyms:
US10072001, Example 40 | US10259811, Example 40
Type:
Small organic molecule
Emp. Form.:
C27H24N4O3
Mol. Mass.:
452.5045
SMILES:
CNC(=O)c1cccc(c1)-c1cc2c(ccnc2[nH]1)-c1ccc(OC2CCOCC2)c(c1)C#N
: