Target
Muscarinic acetylcholine receptor M1
Ligand
BDBM84978
Substrate
Ki
>10000±n/a nM
Comments
PDSP_3186
Citation
 Butterweck, VNahrstedt, AEvans, JHufeisen, SRauser, LSavage, JPopadak, BErnsberger, PRoth, BL In vitro receptor screening of pure constituents of St. John's wort reveals novel interactions with a number of GPCRs. Psychopharmacology (Berl) 162:193-202 (2002)  
Target
Name:
Muscarinic acetylcholine receptor M1
Synonyms:
ACM1_HUMAN Cholinergic receptor, muscarinic 1 | Cholinergic, muscarinic M1
Type:
Protein
Mol. Mass.:
51442.54
Organism:
Homo sapiens (Human)
Description:
P11229
Residue:
460
  
Inhibitor
Name:
BDBM84978
Synonyms:
Quercitrin | cid_5280459
Type:
Small organic molecule
Emp. Form.:
C21H20O11
Mol. Mass.:
448.3769
SMILES:
C[C@@H]1O[C@@H](Oc2c(O)c3c(cc(O)cc3=O)oc2-c2ccc(O)c(O)c2)[C@H](O)[C@H](O)[C@H]1O
: