Target
Vasoactive intestinal polypeptide receptor 1
Ligand
BDBM81828
Substrate
Ki
1.6±n/a nM
Comments
PDSP_2122
Citation
 Igarashi, HIto, TPradhan, TKMantey, SAHou, WCoy, DHJensen, RT Elucidation of the vasoactive intestinal peptide pharmacophore for VPAC(2) receptors in human and rat and comparison to the pharmacophore for VPAC(1) receptors. J Pharmacol Exp Ther 303:445-60 (2002)  
Target
Name:
Vasoactive intestinal polypeptide receptor 1
Synonyms:
VIP 1 VIPR1_HUMAN | Vasoactive intestinal polypeptide receptor 1
Type:
Enzyme Catalytic Domain
Mol. Mass.:
51557.18
Organism:
Homo sapiens (Human)
Description:
VIP 1 VIPR1 0::P32241
Residue:
457
  
Inhibitor
Name:
BDBM81828
Synonyms:
CAS_37221-79-7 Vasoactive intestinal polypeptide
Type:
Small organic molecule
Emp. Form.:
C147H237N43O43S
Mol. Mass.:
3326.782
SMILES:
CCC(C)C(NC(=O)C(CO)NC(=O)C(CC(N)=O)NC(=O)C(CC(C)C)NC(=O)C(Cc1ccc(O)cc1)NC(=O)C(CCCCN)NC(=O)C(CCCCN)NC(=O)C(NC(=O)C(C)NC(=O)C(CCSC)NC(=O)C(CCC(N)=O)NC(=O)C(CCCCN)NC(=O)C(CCCN=C(N)N)NC(=O)C(CC(C)C)NC(=O)C(CCCN=C(N)N)NC(=O)C(NC(=O)C(Cc1ccc(O)cc1)NC(=O)C(CC(N)=O)NC(=O)C(CC(O)=O)NC(=O)C(NC(=O)C(Cc1ccccc1)NC(=O)C(NC(=O)C(C)NC(=O)C(CC(O)=O)NC(=O)C(CO)NC(=O)C(N)Cc1cnc[nH]1)C(C)C)C(C)O)C(C)O)C(C)C)C(=O)NC(CC(C)C)C(=O)NC(CC(N)=O)C(O)=O
: