Target
Vasoactive intestinal polypeptide receptor 2
Ligand
BDBM86050
Substrate
Ki
2.1±n/a nM
Comments
PDSP_3073
Citation
 Igarashi, HIto, TPradhan, TKMantey, SAHou, WCoy, DHJensen, RT Elucidation of the vasoactive intestinal peptide pharmacophore for VPAC(2) receptors in human and rat and comparison to the pharmacophore for VPAC(1) receptors. J Pharmacol Exp Ther 303:445-60 (2002)  
Target
Name:
Vasoactive intestinal polypeptide receptor 2
Synonyms:
VIP 2 VIPR2 | VIPR2_HUMAN
Type:
Enzyme Catalytic Domain
Mol. Mass.:
49488.30
Organism:
Homo sapiens (Human)
Description:
VIP 2 VIPR2 HUMAN::P41587
Residue:
438
  
Inhibitor
Name:
BDBM86050
Synonyms:
Ac-L-His-L-Ser-L-Asp-L-Ala-L-Val-L-Phe-L-Thr-L-Glu-L-Asn-L-Tyr-L-Thr-L-Lys-L-Leu-L-Arg-L-Lys-L-Gln-L-Nle-L-Ala-L-Ala-L-Lys-L-Lys(1)-L-Tyr-L-Leu-L-Asn-L-Asp(1)-L-Leu-L-Lys-L-Lys-Gly-Gly-L-Thr-NH2 | Ro 25-1553
Type:
Small organic molecule
Emp. Form.:
C159H258N46O47S
Mol. Mass.:
3598.095
SMILES:
CSCC[C@H](NC(=O)[C@H](CCC(N)=O)NC(=O)[C@H](CCCCN)NC(=O)[C@H](CCCN=C(N)N)NC(=O)[C@H](CC(C)C)NC(=O)[C@H](CCCCN)NC(=O)C(NC(=O)[C@H](Cc1ccc(O)cc1)NC(=O)[C@H](CC(N)=O)NC(=O)[C@H](CCC(O)=O)NC(=O)[C@@H](NC(=O)[C@H](Cc1ccccc1)NC(=O)[C@@H](NC(=O)[C@H](C)NC(=O)[C@H](CC(O)=O)NC(=O)[C@H](CO)NC(=O)[C@H](Cc1cnc[nH]1)NC(C)=O)C(C)C)[C@@H](C)O)[C@@H](C)O)C(=O)N[C@@H](C)C(=O)N[C@@H](C)C(=O)N[C@@H](CCCCN)C(=O)N[C@@H](CCCCN)C(=O)N[C@@H](Cc1ccc(O)cc1)C(=O)N[C@@H](CC(C)C)C(=O)N[C@@H](CC(N)=O)C(=O)N[C@@H](CC(O)=O)C(=O)N[C@@H](CC(C)C)C(=O)N[C@@H](CCCCN)C(=O)N[C@@H](CCCCN)C(=O)NCC(=O)NCC(=O)N[C@@H](C(C)O)C(N)=O
: