Target
Substance-P receptor
Ligand
BDBM86055
Substrate
Ki
0.23±n/a nM
Comments
PDSP_2982
Citation
 Emonds-Alt, XProietto, VSteinberg, ROury-Donat, FVigé, XVilain, PNaline, EDaoui, SAdvenier, CLe Fur, GMaffrand, JPSoubrié, PPascal, M SSR240600 [(R)-2-(1-[2-[4-[2-[3,5-bis(trifluoromethyl)phenyl]acetyl]-2-(3,4-dichlorophenyl)-2-morpholinyl]ethyl]- 4-piperidinyl)-2-methylpropanamide], a centrally active nonpeptide antagonist of the tachykinin neurokinin-1 receptor: I. biochemical and pharmacological characterization. J Pharmacol Exp Ther 303:1171-9 (2002)  
Target
Name:
Substance-P receptor
Synonyms:
NK1R_CAVPO Neurokinin NK1 TACR1
Type:
Enzyme Catalytic Domain
Mol. Mass.:
46261.42
Organism:
GUINEA PIG
Description:
Neurokinin NK1 TACR1 GUINEA PIG::P30547
Residue:
407
  
Inhibitor
Name:
BDBM86055
Synonyms:
SSR240600
Type:
Small organic molecule
Emp. Form.:
C31H35Cl2F6N3O3
Mol. Mass.:
682.524
SMILES:
CC(C)(C1CCN(CCC2(CN(CCO2)C(=O)Cc2cc(cc(c2)C(F)(F)F)C(F)(F)F)c2ccc(Cl)c(Cl)c2)CC1)C(N)=O
: