Target
Substance-K receptor
Ligand
BDBM81942
Substrate
Ki
0.48±n/a nM
Comments
PDSP_1333
Citation
 Emonds-Alt, XProietto, VSteinberg, ROury-Donat, FVigé, XVilain, PNaline, EDaoui, SAdvenier, CLe Fur, GMaffrand, JPSoubrié, PPascal, M SSR240600 [(R)-2-(1-[2-[4-[2-[3,5-bis(trifluoromethyl)phenyl]acetyl]-2-(3,4-dichlorophenyl)-2-morpholinyl]ethyl]- 4-piperidinyl)-2-methylpropanamide], a centrally active nonpeptide antagonist of the tachykinin neurokinin-1 receptor: I. biochemical and pharmacological characterization. J Pharmacol Exp Ther 303:1171-9 (2002)  
Target
Name:
Substance-K receptor
Synonyms:
NK-2 receptor NK2R NKNAR Neurokinin A receptor Neurokinin-2 (NK-2) SKR TACR2 Tachykinin receptor 2 (NK2) | hnk-3
Type:
Protein
Mol. Mass.:
44455.78
Organism:
Homo sapiens (Human)
Description:
P21452
Residue:
398
  
Inhibitor
Name:
BDBM81942
Synonyms:
CAS_55582 NSC_55582 Substance K
Type:
Small organic molecule
Emp. Form.:
C50H80N14O14S
Mol. Mass.:
1133.321
SMILES:
CSCCC(NC(=O)C(CC(C)C)NC(=O)CNC(=O)C(NC(=O)C(Cc1ccccc1)NC(=O)C(CO)NC(=O)C(CC(O)=O)NC(=O)C(NC(=O)C(CCCCN)NC(=O)C(N)Cc1cnc[nH]1)C(C)O)C(C)C)C(N)=O
: