Target
Substance-K receptor
Ligand
BDBM86055
Substrate
Ki
24±n/a nM
Comments
PDSP_2982
Citation
 Emonds-Alt, XProietto, VSteinberg, ROury-Donat, FVigé, XVilain, PNaline, EDaoui, SAdvenier, CLe Fur, GMaffrand, JPSoubrié, PPascal, M SSR240600 [(R)-2-(1-[2-[4-[2-[3,5-bis(trifluoromethyl)phenyl]acetyl]-2-(3,4-dichlorophenyl)-2-morpholinyl]ethyl]- 4-piperidinyl)-2-methylpropanamide], a centrally active nonpeptide antagonist of the tachykinin neurokinin-1 receptor: I. biochemical and pharmacological characterization. J Pharmacol Exp Ther 303:1171-9 (2002)  
Target
Name:
Substance-K receptor
Synonyms:
NK-2 receptor NK2R NKNAR Neurokinin A receptor Neurokinin-2 (NK-2) SKR TACR2 Tachykinin receptor 2 (NK2) | hnk-3
Type:
Protein
Mol. Mass.:
44455.78
Organism:
Homo sapiens (Human)
Description:
P21452
Residue:
398
  
Inhibitor
Name:
BDBM86055
Synonyms:
SSR240600
Type:
Small organic molecule
Emp. Form.:
C31H35Cl2F6N3O3
Mol. Mass.:
682.524
SMILES:
CC(C)(C1CCN(CCC2(CN(CCO2)C(=O)Cc2cc(cc(c2)C(F)(F)F)C(F)(F)F)c2ccc(Cl)c(Cl)c2)CC1)C(N)=O
: