Target
Type-2 angiotensin II receptor
Ligand
BDBM82077
Substrate
Ki
0.31±n/a nM
Comments
PDSP_321
Citation
 Inada, YNakane, TChiba, S Binding of KRH-594, an antagonist of the angiotensin II type 1 receptor, to cloned human and rat angiotensin II receptors. Fundam Clin Pharmacol 16:317-23 (2002)  
Target
Name:
Type-2 angiotensin II receptor
Synonyms:
AGTR2_RAT Agtr2 Angiotensin II receptor Type-2 angiotensin II receptor
Type:
Enzyme Catalytic Domain
Mol. Mass.:
41346.62
Organism:
RAT
Description:
Angiotensin II AT2 0 0::P35351
Residue:
363
  
Inhibitor
Name:
BDBM82077
Synonyms:
Angiotensin II NSC_439662
Type:
Small organic molecule
Emp. Form.:
C57H80N16O12
Mol. Mass.:
1181.3451
SMILES:
CCC(C)C(NC(=O)C(Cc1ccc(O)cc1)NC(=O)C(NC(=O)C(CCCN=C(N)N)NC(=O)C(N)CC(O)=O)C(C)C)C(=O)NC(Cc1cnc[nH]1)C(=O)NC(Cc1cnc[nH]1)C(=O)N1CCCC1C(=O)NC(Cc1ccccc1)C(C)=O
: