Target
Type-2 angiotensin II receptor
Ligand
BDBM50287290
Substrate
Ki
9360±n/a nM
Comments
PDSP_3385
Citation
 Inada, YNakane, TChiba, S Binding of KRH-594, an antagonist of the angiotensin II type 1 receptor, to cloned human and rat angiotensin II receptors. Fundam Clin Pharmacol 16:317-23 (2002)  
Target
Name:
Type-2 angiotensin II receptor
Synonyms:
AGTR2_RAT Agtr2 Angiotensin II receptor Type-2 angiotensin II receptor
Type:
Enzyme Catalytic Domain
Mol. Mass.:
41346.62
Organism:
RAT
Description:
Angiotensin II AT2 0 0::P35351
Residue:
363
  
Inhibitor
Name:
BDBM50287290
Synonyms:
CHEMBL34866 Potassium; 2-[5-ethyl-3-[2'-(1H-tetrazol-5-yl)-biphenyl-4-ylmethyl]-3H-[1,3,4]thiadiazol-(2Z)-ylidenecarbamoyl]-cyclopent-1-enecarboxylate
Type:
Small organic molecule
Emp. Form.:
C25H22N7O3S
Mol. Mass.:
500.553
SMILES:
CCc1nn(Cc2ccc(cc2)-c2ccccc2-c2nnn[nH]2)c(=NC(=O)C2=C(CCC2)C([O-])=O)s1
: