Target
L-lactate dehydrogenase A chain
Ligand
BDBM86131
Substrate
Meas. Tech.
Surface Plasmon Resonance (SPR) Assay
pH
7.4±0
Kd
46±n/a nM
Citation
 Ward, RABrassington, CBreeze, ALCaputo, ACritchlow, SDavies, GGoodwin, LHassall, GGreenwood, RHoldgate, GAMrosek, MNorman, RAPearson, STart, JTucker, JAVogtherr, MWhittaker, DWingfield, JWinter, JHudson, K Design and synthesis of novel lactate dehydrogenase a inhibitors by fragment-based lead generation. J Med Chem 55:3285-306 (2012)  
Target
Name:
L-lactate dehydrogenase A chain
Synonyms:
L-lactate dehydrogenase A LDHA_RAT Ldh1 | Ldha
Type:
Protein
Mol. Mass.:
36456.12
Organism:
Rattus norvegicus (Rat)
Description:
P04642::PDB Codes: 4ajl, 4aj2, 4aje, 4aji, 4ajk, 4ajh, 4ajl, 4al4, 4ajh, 4ajo
Residue:
332
  
Inhibitor
Name:
BDBM86131
Synonyms:
LDHA Inhibitor, 27
Type:
Small organic molecule
Emp. Form.:
C26H30N4O7S2
Mol. Mass.:
574.669
SMILES:
CCCSc1nc2ccc(NC(=O)CCNC(=O)NCCOc3ccc(CC(C(O)=O)C(O)=O)cc3)cc2s1
: