Target
Transthyretin
Ligand
BDBM249529
Substrate
Meas. Tech.
Scintillation Proximity RBP4 Binding Assay
pH
7.4±n/a
Temperature
298.15±n/a K
IC50
17.0±n/a nM
Comments
extracted
Citation
 Petrukhin, KCioffi, CJohnson, GAllikmets, RFreeman, EChen, PConlon, MZhu, L Substituted 4-phenylpiperidines, their preparation and use US Patent  US10072016 Publication Date 9/11/2018 
Target
Name:
Transthyretin
Synonyms:
ATTR Prealbumin TTHY_HUMAN Transthyretin (TTR)
Type:
Enzyme
Mol. Mass.:
15884.31
Organism:
Homo sapiens (Human)
Description:
P02766
Residue:
147
  
Inhibitor
Name:
BDBM249529
Synonyms:
US10072016, Compound 127 US10913746, Compound 127 US9434727, 127 | US9777010, Compound 127
Type:
Small organic molecule
Emp. Form.:
C22H25F5N4O2
Mol. Mass.:
472.4515
SMILES:
COCCN1CCc2[nH]nc(C(=O)N3CCC(CC3)c3cc(F)cc(F)c3C(F)(F)F)c2C1
: