Target
5-hydroxytryptamine receptor 6
Ligand
BDBM86198
Substrate
Ki
>10000±n/a nM
Comments
PDSP_2974
Citation
 Shi, QSavage, JEHufeisen, SJRauser, LGrajkowska, EErnsberger, PWroblewski, JTNadeau, JHRoth, BL L-homocysteine sulfinic acid and other acidic homocysteine derivatives are potent and selective metabotropic glutamate receptor agonists. J Pharmacol Exp Ther 305:131-42 (2003)  
Target
Name:
5-hydroxytryptamine receptor 6
Synonyms:
5-HT-6 5-hydroxytryptamine receptor 6 (5-HT-6) 5-hydroxytryptamine receptor 6 (5HT6) HTR6 Serotonin 6 (5-HT6) receptor | Serotonin Receptor 6
Type:
G Protein-Coupled Receptor (GPCR)
Mol. Mass.:
46968.43
Organism:
Homo sapiens (Human)
Description:
P50406
Residue:
440
  
Inhibitor
Name:
BDBM86198
Synonyms:
CAS_134505 NSC_134505
Type:
Small organic molecule
Emp. Form.:
C4H7NOS
Mol. Mass.:
117.169
SMILES:
N[C@H]1CCSC1=O
: