Target
Alpha-1B adrenergic receptor
Ligand
BDBM86198
Substrate
Ki
>10000±n/a nM
Comments
PDSP_2974
Citation
 Shi, QSavage, JEHufeisen, SJRauser, LGrajkowska, EErnsberger, PWroblewski, JTNadeau, JHRoth, BL L-homocysteine sulfinic acid and other acidic homocysteine derivatives are potent and selective metabotropic glutamate receptor agonists. J Pharmacol Exp Ther 305:131-42 (2003)  
Target
Name:
Alpha-1B adrenergic receptor
Synonyms:
ADA1B_HUMAN Adrenergic alpha1B Adrenergic receptor alpha Alpha 1B-adrenoreceptor | Alpha-1B adrenergic receptor
Type:
Enzyme
Mol. Mass.:
56862.13
Organism:
Homo sapiens (Human)
Description:
P35368
Residue:
520
  
Inhibitor
Name:
BDBM86198
Synonyms:
CAS_134505 NSC_134505
Type:
Small organic molecule
Emp. Form.:
C4H7NOS
Mol. Mass.:
117.169
SMILES:
N[C@H]1CCSC1=O
: