Target
Muscarinic acetylcholine receptor M5
Ligand
BDBM86198
Substrate
Ki
>10000±n/a nM
Comments
PDSP_2974
Citation
 Shi, QSavage, JEHufeisen, SJRauser, LGrajkowska, EErnsberger, PWroblewski, JTNadeau, JHRoth, BL L-homocysteine sulfinic acid and other acidic homocysteine derivatives are potent and selective metabotropic glutamate receptor agonists. J Pharmacol Exp Ther 305:131-42 (2003)  
Target
Name:
Muscarinic acetylcholine receptor M5
Synonyms:
ACM5_HUMAN | CHRM5
Type:
PROTEIN
Mol. Mass.:
60102.35
Organism:
Homo sapiens (Human)
Description:
ChEMBL_1517990
Residue:
532
  
Inhibitor
Name:
BDBM86198
Synonyms:
CAS_134505 NSC_134505
Type:
Small organic molecule
Emp. Form.:
C4H7NOS
Mol. Mass.:
117.169
SMILES:
N[C@H]1CCSC1=O
: