Target
Sodium-dependent dopamine transporter
Ligand
BDBM86198
Substrate
Ki
>10000±n/a nM
Comments
PDSP_2974
Citation
 Shi, QSavage, JEHufeisen, SJRauser, LGrajkowska, EErnsberger, PWroblewski, JTNadeau, JHRoth, BL L-homocysteine sulfinic acid and other acidic homocysteine derivatives are potent and selective metabotropic glutamate receptor agonists. J Pharmacol Exp Ther 305:131-42 (2003)  
Target
Name:
Sodium-dependent dopamine transporter
Synonyms:
DA transporter DAT1 Dopamine transporter protein (DAT) SC6A3_HUMAN Sodium-dependent dopamine transporter Solute carrier family 6 member 3
Type:
Multi-pass membrane protein
Mol. Mass.:
68497.11
Organism:
Homo sapiens (Human)
Description:
Q01959
Residue:
620
  
Inhibitor
Name:
BDBM86198
Synonyms:
CAS_134505 NSC_134505
Type:
Small organic molecule
Emp. Form.:
C4H7NOS
Mol. Mass.:
117.169
SMILES:
N[C@H]1CCSC1=O
: