Target
Glutamate receptor ionotropic, NMDA 1
Ligand
BDBM86198
Substrate
Ki
>10000±n/a nM
Comments
PDSP_2974
Citation
 Shi, QSavage, JEHufeisen, SJRauser, LGrajkowska, EErnsberger, PWroblewski, JTNadeau, JHRoth, BL L-homocysteine sulfinic acid and other acidic homocysteine derivatives are potent and selective metabotropic glutamate receptor agonists. J Pharmacol Exp Ther 305:131-42 (2003)  
Target
Name:
Glutamate receptor ionotropic, NMDA 1
Synonyms:
Glutamate (NMDA) receptor subunit zeta 1 Glutamate-NMDA-Channel Glutamate-NMDA-Polyamine NMDA Nmdar1 | phencyclidine
Type:
Enzyme Catalytic Domain
Mol. Mass.:
105533.40
Organism:
RAT
Description:
P35439
Residue:
938
  
Inhibitor
Name:
BDBM86198
Synonyms:
CAS_134505 NSC_134505
Type:
Small organic molecule
Emp. Form.:
C4H7NOS
Mol. Mass.:
117.169
SMILES:
N[C@H]1CCSC1=O
: