Target
Kappa-type opioid receptor
Ligand
BDBM86254
Substrate
Ki
>10000±n/a nM
Comments
PDSP_3169
Citation
 Neal, CROwens, CETaylor, LPHoversten, MTAkil, HWatson, SJ Binding and GTPgammaS autoradiographic analysis of preproorphanin precursor peptide products at the ORL1 and opioid receptors. J Chem Neuroanat 25:233-47 (2003)  
Target
Name:
Kappa-type opioid receptor
Synonyms:
KOR-1 OPIATE Kappa Opioid receptor Ror-d
Type:
G Protein-Coupled Receptor (GPCR)
Mol. Mass.:
42692.90
Organism:
Rattus norvegicus (rat)
Description:
P34975
Residue:
380
  
Inhibitor
Name:
BDBM86254
Synonyms:
OFQ II 1-17
Type:
Small organic molecule
Emp. Form.:
C92H141N23O28S2
Mol. Mass.:
2081.371
SMILES:
[#6]-[#16]-[#6]-[#6]-[#6@@H](-[#7]-[#6](=O)-[#6@@H](-[#6]-[#8])-[#7]-[#6](=O)-[#6@@H](-[#6]-[#6](-[#6])-[#6])-[#7]-[#6](=O)-[#6@H](-[#7]-[#6](=O)-[#6@@H](-[#6]-[#6](-[#6])-[#6])-[#7]-[#6](=O)-[#6@@H](-[#6]-c1ccc(-[#8])cc1)-[#7]-[#6](=O)-[#6@@H](-[#6]-[#6]-[#6](-[#7])=O)-[#7]-[#6](=O)-[#6@@H](-[#6]-[#6]-[#6]\[#7]=[#6](/[#7])-[#7])-[#7]-[#6](=O)-[#6@H](-[#6]-[#6]-[#16]-[#6])-[#7]-[#6](=O)-[#6@H](-[#6]-c1ccccc1)-[#7]-[#6](=O)-[#6@H](-[#6]-[#6]-[#6](-[#8])=O)-[#7]-[#6](=O)-[#6@@H](-[#6]-[#8])-[#7]-[#6](=O)-[#6@@H](-[#7])-[#6]-c1ccccc1)-[#6](-[#6])-[#6])-[#6](=O)-[#7]-[#6@H](-[#6]-[#6]-[#6](-[#7])=O)-[#6](=O)-[#7]-[#6@H](-[#6]-[#8])-[#6](=O)-[#7]-[#6@H](-[#6]-[#8])-[#6](=O)-[#7]-[#6@H](-[#6]-[#6]-[#6](-[#7])=O)-[#6](-[#8])=O
: