Target
Mu-type opioid receptor
Ligand
BDBM86254
Substrate
Ki
>10000±n/a nM
Comments
PDSP_3169
Citation
 Neal, CROwens, CETaylor, LPHoversten, MTAkil, HWatson, SJ Binding and GTPgammaS autoradiographic analysis of preproorphanin precursor peptide products at the ORL1 and opioid receptors. J Chem Neuroanat 25:233-47 (2003)  
Target
Name:
Mu-type opioid receptor
Synonyms:
MOR-1 Mu-type opioid receptor (MOR) OPRM_RAT Opioid receptor B Ror-b
Type:
G Protein-Coupled Receptor (GPCR)
Mol. Mass.:
44503.11
Organism:
Rattus norvegicus (rat)
Description:
Competition binding assays were carried out using membrane preparations from transfected HN9.10 cells that constitutively expressed the mu opioid receptor.
Residue:
398
  
Inhibitor
Name:
BDBM86254
Synonyms:
OFQ II 1-17
Type:
Small organic molecule
Emp. Form.:
C92H141N23O28S2
Mol. Mass.:
2081.371
SMILES:
[#6]-[#16]-[#6]-[#6]-[#6@@H](-[#7]-[#6](=O)-[#6@@H](-[#6]-[#8])-[#7]-[#6](=O)-[#6@@H](-[#6]-[#6](-[#6])-[#6])-[#7]-[#6](=O)-[#6@H](-[#7]-[#6](=O)-[#6@@H](-[#6]-[#6](-[#6])-[#6])-[#7]-[#6](=O)-[#6@@H](-[#6]-c1ccc(-[#8])cc1)-[#7]-[#6](=O)-[#6@@H](-[#6]-[#6]-[#6](-[#7])=O)-[#7]-[#6](=O)-[#6@@H](-[#6]-[#6]-[#6]\[#7]=[#6](/[#7])-[#7])-[#7]-[#6](=O)-[#6@H](-[#6]-[#6]-[#16]-[#6])-[#7]-[#6](=O)-[#6@H](-[#6]-c1ccccc1)-[#7]-[#6](=O)-[#6@H](-[#6]-[#6]-[#6](-[#8])=O)-[#7]-[#6](=O)-[#6@@H](-[#6]-[#8])-[#7]-[#6](=O)-[#6@@H](-[#7])-[#6]-c1ccccc1)-[#6](-[#6])-[#6])-[#6](=O)-[#7]-[#6@H](-[#6]-[#6]-[#6](-[#7])=O)-[#6](=O)-[#7]-[#6@H](-[#6]-[#8])-[#6](=O)-[#7]-[#6@H](-[#6]-[#8])-[#6](=O)-[#7]-[#6@H](-[#6]-[#6]-[#6](-[#7])=O)-[#6](-[#8])=O
: