Target
Beta-2 adrenergic receptor
Ligand
BDBM25771
Substrate
Ki
25.12±n/a nM
Comments
PDSP_4082
Citation
 Carter, AAHill, SJ Characterization of isoprenaline- and salmeterol-stimulated interactions between beta2-adrenoceptors and beta-arrestin 2 using beta-galactosidase complementation in C2C12 cells. J Pharmacol Exp Ther 315:839-48 (2005)  
Target
Name:
Beta-2 adrenergic receptor
Synonyms:
ADRB2 ADRB2_HUMAN Beta-2 adrenoceptor | Beta-2 adrenoreceptor
Type:
Mol. Mass.:
46461.69
Organism:
Homo sapiens (Human)
Description:
P07550
Residue:
413
  
Inhibitor
Name:
BDBM25771
Synonyms:
1-hydroxy-2-naphthoic acid;4-[1-hydroxy-2-[6-(4-phenylbutoxy)hexylamino]ethyl]-2-methylol-phenol Aeromax Serevent | salmeterol xinafoate
Type:
Small organic molecule
Emp. Form.:
C25H37NO4
Mol. Mass.:
415.5656
SMILES:
OCc1cc(ccc1O)C(O)CNCCCCCCOCCCCc1ccccc1
: