Target
Polyphenol oxidase 2
Ligand
BDBM26190
Substrate
Meas. Tech.
Enzyme Assay
pH
6.8±0
Temperature
298.15±0 K
IC50
8.757e+4±n/a nM
Citation
 Liu, SHChu, IMPan, IH Effects of hydroxybenzyl alcohols on melanogenesis in melanocyte-keratinocyte co-culture and monolayer culture of melanocytes. J Enzyme Inhib Med Chem 23:526-34 (2008)  
Target
Name:
Polyphenol oxidase 2
Synonyms:
Monophenol monooxygenase PPO2 Tyrosinase
Type:
Protein
Mol. Mass.:
63923.66
Organism:
Agaricus bisporus (Common mushroom)
Description:
O42713
Residue:
556
  
Inhibitor
Name:
BDBM26190
Synonyms:
1,4-Dihydroxybenzene, XIII CHEMBL537 Hydroquinone, HQ phenol derivative, 4
Type:
Small organic molecule
Emp. Form.:
C6H6O2
Mol. Mass.:
110.1106
SMILES:
Oc1ccc(O)cc1
: