Target
Phospholipase D2
Ligand
BDBM87120
Substrate
Meas. Tech.
Cellular PLD2 concentration response
IC50
20±n/a nM
Citation
 PubChem, PC Cellular PLD2 concentration response PubChem Bioassay (2011)[AID] 
Target
Name:
Phospholipase D2
Synonyms:
PLD2 Phospholipase D2 phospholipase D2 isoform PLD2A
Type:
Protein
Mol. Mass.:
106002.47
Organism:
Homo sapiens (Human)
Description:
Residue:
933
  
Inhibitor
Name:
BDBM87120
Synonyms:
CHEMBL1254577 N-[2-[1-(3-fluorophenyl)-4-oxidanylidene-1,3,8-triazaspiro[4.5]decan-8-yl]ethyl]naphthalene-2-carboxamide;2,2,2-tris(fluoranyl)ethanoic acid N-[2-[1-(3-fluorophenyl)-4-oxo-1,3,8-triazaspiro[4.5]decan-8-yl]ethyl]naphthalene-2-carboxamide;2,2,2-trifluoroacetic acid VU0364739-1 | cid_46939577
Type:
Small organic molecule
Emp. Form.:
C26H27FN4O2
Mol. Mass.:
446.5166
SMILES:
Fc1cccc(c1)N1CNC(=O)C11CCN(CCNC(=O)c2ccc3ccccc3c2)CC1
: