Target
Phospholipase D2
Ligand
BDBM50206160
Substrate
Meas. Tech.
Cellular PLD2 concentration response
IC50
280±n/a nM
Citation
 PubChem, PC Cellular PLD2 concentration response PubChem Bioassay (2011)[AID] 
Target
Name:
Phospholipase D2
Synonyms:
PLD2 Phospholipase D2 phospholipase D2 isoform PLD2A
Type:
Protein
Mol. Mass.:
106002.47
Organism:
Homo sapiens (Human)
Description:
Residue:
933
  
Inhibitor
Name:
BDBM50206160
Synonyms:
CHEMBL245621 Halopemide, 8 N-(2-(4-(5-chloro-2-oxo-2,3-dihydrobenzo[d]imidazol-1-yl)piperidin-1-yl)ethyl)-4-fluorobenzamide | cid_65490
Type:
Small organic molecule
Emp. Form.:
C21H22ClFN4O2
Mol. Mass.:
416.876
SMILES:
Fc1ccc(cc1)C(=O)NCCN1CCC(CC1)n1c2ccc(Cl)cc2[nH]c1=O
: