Target
Tegument protein VP16
Ligand
BDBM69148
Substrate
Meas. Tech.
Counterscreen for inhibitors of the Steroid Receptor Coactivator 3 (SRC3; NCOA3)
IC50
3809±n/a nM
Citation
 PubChem, PC Counterscreen for inhibitors of the Steroid Receptor Coactivator 3 (SRC3; NCOA3): Luminescence-based cell-based high throughput dose response assay to identify inhibitors of the Herpes Virus Virion Protein 16 (VP16) PubChem Bioassay (2012)[AID] 
Target
Name:
Tegument protein VP16
Synonyms:
Alpha trans-inducing protein (VP16) transactivating tegument protein VP16
Type:
PROTEIN
Mol. Mass.:
54325.13
Organism:
Human herpesvirus 1 (strain 17) (HHV-1) (Human herpes simplex virus1)
Description:
EBI_100271
Residue:
490
  
Inhibitor
Name:
BDBM69148
Synonyms:
2-[(4-fluorobenzyl)thio]-5-(4-pyridyl)-1,3,4-oxadiazole 2-[(4-fluorophenyl)methylthio]-5-pyridin-4-yl-1,3,4-oxadiazole MLS000675386 cid_975378
Type:
Small organic molecule
Emp. Form.:
C14H10FN3OS
Mol. Mass.:
287.312
SMILES:
Fc1ccc(CSc2nnc(o2)-c2ccncc2)cc1
: