Target
Botulinum neurotoxin type A
Ligand
BDBM44497
Substrate
Meas. Tech.
High-throughput multiplex microsphere dose response for inhibitors of toxin protease, specifically Botulinum neurotoxin light chain A protease, compounds from Cherry Pick 01
EC50
6900±n/a nM
Citation
 PubChem, PC High-throughput multiplex microsphere dose response for inhibitors of toxin protease, specifically Botulinum neurotoxin light chain A protease, compounds from Cherry Pick 01 PubChem Bioassay (2012)[AID] 
Target
Name:
Botulinum neurotoxin type A
Synonyms:
BXA1_CLOBH bna | botA
Type:
PROTEIN
Mol. Mass.:
149421.96
Organism:
Clostridium botulinum (strain Hall / ATCC 3502 / NCTC 13319 / Type A)
Description:
ChEMBL_987932
Residue:
1296
  
Inhibitor
Name:
BDBM44497
Synonyms:
6-(5-ethylsulfanyl-1,3,4-oxadiazol-2-yl)-3,4-diphenyl-thieno[2,3-c]pyridazin-5-amine 6-[5-(ethylsulfanyl)-1,3,4-oxadiazol-2-yl]-3,4-diphenylthieno[2,3-c]pyridazin-5-amine MLS000545814 [6-[5-(ethylthio)-1,3,4-oxadiazol-2-yl]-3,4-diphenyl-thieno[2,3-c]pyridazin-5-yl]amine | cid_6406850
Type:
Small organic molecule
Emp. Form.:
C22H17N5OS2
Mol. Mass.:
431.533
SMILES:
CCSc1nnc(o1)-c1sc2nnc(-c3ccccc3)c(-c3ccccc3)c2c1N
: