Target
Botulinum neurotoxin type A
Ligand
BDBM72525
Substrate
Meas. Tech.
High-throughput multiplex microsphere dose response for inhibitors of toxin protease, specifically Botulinum neurotoxin light chain A protease, compounds from Cherry Pick 01
EC50
7900±n/a nM
Citation
 PubChem, PC High-throughput multiplex microsphere dose response for inhibitors of toxin protease, specifically Botulinum neurotoxin light chain A protease, compounds from Cherry Pick 01 PubChem Bioassay (2012)[AID] 
Target
Name:
Botulinum neurotoxin type A
Synonyms:
BXA1_CLOBH bna | botA
Type:
PROTEIN
Mol. Mass.:
149421.96
Organism:
Clostridium botulinum (strain Hall / ATCC 3502 / NCTC 13319 / Type A)
Description:
ChEMBL_987932
Residue:
1296
  
Inhibitor
Name:
BDBM72525
Synonyms:
1-[2-[3-(3,4-dimethoxyphenyl)-5-thiophen-2-yl-3,4-dihydropyrazol-2-yl]-4-methyl-1,3-thiazol-5-yl]ethanone;hydrobromide 1-[2-[5-(3,4-dimethoxyphenyl)-3-(2-thienyl)-2-pyrazolin-1-yl]-4-methyl-thiazol-5-yl]ethanone;hydrobromide 1-{2-[5-(3,4-dimethoxyphenyl)-3-thien-2-yl-4,5-dihydro-1H-pyrazol-1-yl]-4-methyl-1,3-thiazol-5-yl}ethanone SMR000305720 | cid_16193282
Type:
Small organic molecule
Emp. Form.:
C21H21N3O3S2
Mol. Mass.:
427.54
SMILES:
COc1ccc(cc1OC)C1CC(=NN1c1nc(C)c(s1)C(C)=O)c1cccs1
: