Target
Nuclear receptor coactivator 3
Ligand
BDBM58345
Substrate
Meas. Tech.
Counterscreen for inhibitors of the Steroid Receptor Coactivator 1 (SRC1; NCOA1)
IC50
11015±n/a nM
Citation
 PubChem, PC Counterscreen for inhibitors of the Steroid Receptor Coactivator 1 (SRC1; NCOA1): Luminescence-based cell-based high throughput dose response assay to identify inhibitors of the Steroid Receptor Coactivator 3 (SRC3; NCOA3) PubChem Bioassay (2012)[AID] 
Target
Name:
Nuclear receptor coactivator 3
Synonyms:
AIB1 NCOA3 RAC3 nuclear receptor coactivator 3 isoform a
Type:
Enzyme Catalytic Domain
Mol. Mass.:
155305.29
Organism:
Homo sapiens (Human)
Description:
Q9Y6Q9
Residue:
1424
  
Inhibitor
Name:
BDBM58345
Synonyms:
2-[(5E)-5-[2-(2,4-dichlorobenzyl)oxybenzylidene]-4-keto-2-thioxo-thiazolidin-3-yl]acetic acid 2-[(5E)-5-[[2-[(2,4-dichlorophenyl)methoxy]phenyl]methylidene]-4-oxo-2-sulfanylidene-1,3-thiazolidin-3-yl]acetic acid MLS001203417 cid_1240200 | {5-[2-(2,4-Dichloro-benzyloxy)-benzylidene]-4-oxo-2-thioxo-thiazolidin-3-yl}-acetic acid
Type:
Small organic molecule
Emp. Form.:
C19H13Cl2NO4S2
Mol. Mass.:
454.347
SMILES:
OC(=O)CN1C(=S)S\C(=C\c2ccccc2OCc2ccc(Cl)cc2Cl)C1=O
: