Target
Nuclear receptor coactivator 1
Ligand
BDBM63612
Substrate
Meas. Tech.
Luminescence-based cell-based high throughput dose response assay for inhibitors of the Steroid Receptor Coactivator 1 (SRC1; NCOA1)
IC50
>35865±n/a nM
Citation
 PubChem, PC Luminescence-based cell-based high throughput dose response assay for inhibitors of the Steroid Receptor Coactivator 1 (SRC1; NCOA1) PubChem Bioassay (2012)[AID] 
Target
Name:
Nuclear receptor coactivator 1
Synonyms:
BHLHE74 NCOA1 NCoA-1 Protein Hin-2 Renal carcinoma antigen NY-REN-52 SRC1 nuclear receptor coactivator 1 isoform 1
Type:
PROTEIN
Mol. Mass.:
156749.34
Organism:
Homo sapiens (Human)
Description:
ChEMBL_759690
Residue:
1441
  
Inhibitor
Name:
BDBM63612
Synonyms:
(2E)-2-[[4-(trifluoromethyl)anilino]methylene]-7,7a-dihydro-6H-pyrrolo[2,1-b]thiazole-3,5-quinone (2E)-2-[[4-(trifluoromethyl)anilino]methylidene]-7,7a-dihydro-6H-pyrrolo[2,1-b]thiazole-3,5-dione 2-{[4-(trifluoromethyl)anilino]methylene}dihydropyrrolo[2,1-b][1,3]thiazole-3,5(2H,6H)-dione SMR000334321 | cid_5821715
Type:
Small organic molecule
Emp. Form.:
C14H11F3N2O2S
Mol. Mass.:
328.31
SMILES:
FC(F)(F)c1ccc(NC=C2SC3CCC(=O)N3C2=O)cc1
: