Target
Polyadenylate-binding protein 1
Ligand
BDBM34395
Substrate
Meas. Tech.
Dose-response secondary confirmation of microRNA-mediated mRNA deadenylation inhibitors by fluoresence polarization assay using Cy5 labeled peptide
IC50
>66000±n/a nM
Citation
 PubChem, PC Dose-response secondary confirmation of microRNA-mediated mRNA deadenylation inhibitors by fluoresence polarization assay using Cy5 labeled peptide PubChem Bioassay (2012)[AID] 
Target
Name:
Polyadenylate-binding protein 1
Synonyms:
PAB1 PABP1 PABPC1 poly(A) binding protein, cytoplasmic 1 | polyadenylate-binding protein 1
Type:
Enzyme Catalytic Domain
Mol. Mass.:
70694.26
Organism:
Homo sapiens (Human)
Description:
gi_46367787
Residue:
636
  
Inhibitor
Name:
BDBM34395
Synonyms:
4-amino-3-(2-methoxyphenyl)-2-sulfanylidene-1,3-thiazole-5-carboxamide 4-amino-3-(2-methoxyphenyl)-2-thioxo-2,3-dihydro-1,3-thiazole-5-carboxamide 4-azanyl-3-(2-methoxyphenyl)-2-sulfanylidene-1,3-thiazole-5-carboxamide SMR000019507 | cid_3243618
Type:
Small organic molecule
Emp. Form.:
C11H11N3O2S2
Mol. Mass.:
281.354
SMILES:
COc1ccccc1-n1c(N)c(sc1=S)C(N)=O
: