Target
Polyadenylate-binding protein 1
Ligand
BDBM87680
Substrate
Meas. Tech.
Dose-response secondary confirmation of microRNA-mediated mRNA deadenylation inhibitors by fluoresence polarization assay using Cy5 labeled peptide
IC50
>66000±n/a nM
Citation
 PubChem, PC Dose-response secondary confirmation of microRNA-mediated mRNA deadenylation inhibitors by fluoresence polarization assay using Cy5 labeled peptide PubChem Bioassay (2012)[AID] 
Target
Name:
Polyadenylate-binding protein 1
Synonyms:
PAB1 PABP1 PABPC1 poly(A) binding protein, cytoplasmic 1 | polyadenylate-binding protein 1
Type:
Enzyme Catalytic Domain
Mol. Mass.:
70694.26
Organism:
Homo sapiens (Human)
Description:
gi_46367787
Residue:
636
  
Inhibitor
Name:
BDBM87680
Synonyms:
2-(4,5-dihydro-1,3-thiazol-2-ylsulfanyl)-N-(5-methyl-1,2-oxazol-3-yl)acetamide 2-(4,5-dihydro-1,3-thiazol-2-ylthio)-N-(5-methyl-3-isoxazolyl)acetamide MLS000062650 SMR000071187 | cid_845171
Type:
Small organic molecule
Emp. Form.:
C9H11N3O2S2
Mol. Mass.:
257.333
SMILES:
Cc1cc(NC(=O)CSC2=NCCS2)no1
: