Target
Melanocortin receptor 4
Ligand
BDBM88424
Substrate
Meas. Tech.
Luminescence-based cell-based high throughput dose response assay for biased ligands (agonists) of the melanocortin 4 receptor (MC4R)
EC50
>89183±n/a nM
Citation
 PubChem, PC Luminescence-based cell-based high throughput dose response assay for biased ligands (agonists) of the melanocortin 4 receptor (MC4R) PubChem Bioassay (2012)[AID] 
Target
Name:
Melanocortin receptor 4
Synonyms:
MC4-R MC4R_HUMAN Melanocortin receptor 4 (MC-4) Melanocortin receptor 4 (MC4R)
Type:
Enzyme
Mol. Mass.:
36949.50
Organism:
Homo sapiens (Human)
Description:
P32245
Residue:
332
  
Inhibitor
Name:
BDBM88424
Synonyms:
(16Z)-16-[(1-ethyl-3-methyl-4-pyrazolyl)methylidene]-3-hydroxy-10,13-dimethyl-2,3,4,7,8,9,11,12,14,15-decahydro-1H-cyclopenta[a]phenanthren-17-one (16Z)-16-[(1-ethyl-3-methyl-pyrazol-4-yl)methylidene]-10,13-dimethyl-3-oxidanyl-2,3,4,7,8,9,11,12,14,15-decahydro-1H-cyclopenta[a]phenanthren-17-one 16-[(1-ethyl-3-methyl-1H-pyrazol-4-yl)methylene]-3-hydroxyandrost-5-en-17-one SMR000114956 | cid_9549133
Type:
Small organic molecule
Emp. Form.:
C26H36N2O2
Mol. Mass.:
408.5762
SMILES:
CCn1cc(\C=C2\CC3C4CC=C5CC(O)CCC5(C)C4CCC3(C)C2=O)c(C)n1
: