Target
Melanocortin receptor 4
Ligand
BDBM59960
Substrate
Meas. Tech.
Luminescence-based cell-based high throughput dose response assay for biased ligands (agonists) of the melanocortin 4 receptor (MC4R)
EC50
>89209±n/a nM
Citation
 PubChem, PC Luminescence-based cell-based high throughput dose response assay for biased ligands (agonists) of the melanocortin 4 receptor (MC4R) PubChem Bioassay (2012)[AID] 
Target
Name:
Melanocortin receptor 4
Synonyms:
MC4-R MC4R_HUMAN Melanocortin receptor 4 (MC-4) Melanocortin receptor 4 (MC4R)
Type:
Enzyme
Mol. Mass.:
36949.50
Organism:
Homo sapiens (Human)
Description:
P32245
Residue:
332
  
Inhibitor
Name:
BDBM59960
Synonyms:
(3-nitrophenyl) 2-[2-oxidanylidene-2-[(4-propan-2-ylphenyl)amino]ethyl]sulfanylpyridine-3-carboxylate 2-[(2-cumidino-2-keto-ethyl)thio]nicotinic acid (3-nitrophenyl) ester 3-nitrophenyl 2-({2-[(4-isopropylphenyl)amino]-2-oxoethyl}thio)nicotinate SMR000207006 | cid_4066820
Type:
Small organic molecule
Emp. Form.:
C23H21N3O5S
Mol. Mass.:
451.495
SMILES:
CC(C)c1ccc(NC(=O)CSc2ncccc2C(=O)Oc2cccc(c2)[N+]([O-])=O)cc1
: