Target
Melanocortin receptor 4
Ligand
BDBM77785
Substrate
Meas. Tech.
TRFRET-based cell-based high throughput dose response assay for biased ligands (antagonists) of the melanocortin 4 receptor (MC4R)
IC50
>7177±n/a nM
Citation
 PubChem, PC TRFRET-based cell-based high throughput dose response assay for biased ligands (antagonists) of the melanocortin 4 receptor (MC4R) PubChem Bioassay (2012)[AID] 
Target
Name:
Melanocortin receptor 4
Synonyms:
MC4-R MC4R_HUMAN Melanocortin receptor 4 (MC-4) Melanocortin receptor 4 (MC4R)
Type:
Enzyme
Mol. Mass.:
36949.50
Organism:
Homo sapiens (Human)
Description:
P32245
Residue:
332
  
Inhibitor
Name:
BDBM77785
Synonyms:
2-chloranyl-N-[3-(4-methylphenyl)-1-phenyl-pyrazol-4-yl]ethanamide 2-chloro-N-[3-(4-methylphenyl)-1-phenyl-4-pyrazolyl]acetamide MLS000770839 cid_2104090
Type:
Small organic molecule
Emp. Form.:
C18H16ClN3O
Mol. Mass.:
325.792
SMILES:
Cc1ccc(cc1)-c1nn(cc1NC(=O)CCl)-c1ccccc1
: