Target
Tyrosine-protein phosphatase non-receptor type 11
Ligand
BDBM46206
Substrate
Meas. Tech.
Dose Response selectivity of inhibitors of Striatal-Enriched Phosphatase (STEP) in a SHP2 (PTPN11) Inhibition Assay
IC50
5470±n/a nM
Citation
 PubChem, PC Dose Response selectivity of inhibitors of Striatal-Enriched Phosphatase (STEP) in a SHP2 (PTPN11) Inhibition Assay PubChem Bioassay (2012)[AID] 
Target
Name:
Tyrosine-protein phosphatase non-receptor type 11
Synonyms:
3.1.3.48 PTP-1D PTP2C Protein Tyrosine Phosphatase PPN11/Shp2 Protein-Tyrosine Phosphatase SHP-2 Protein-tyrosine phosphatase 2C SH-PTP3 SHP2 Src homology phosphatase 2 (SHP-2) Tyrosine-protein phosphatase non-receptor type 11 (SHP-2) | Tyrosine-protein phosphatase non-receptor type 11 (SHP2)
Type:
Protein phosphatase
Mol. Mass.:
68443.59
Organism:
Homo sapiens (Human)
Description:
Q06124
Residue:
593
  
Inhibitor
Name:
BDBM46206
Synonyms:
MLS-0109562.0001 [1-(2-phenoxyethyl)indol-3-yl]-pyrrolidin-1-yl-methanethione [1-(2-phenoxyethyl)indol-3-yl]-pyrrolidino-methanethione | cid_1324805
Type:
Small organic molecule
Emp. Form.:
C21H22N2OS
Mol. Mass.:
350.477
SMILES:
S=C(N1CCCC1)c1cn(CCOc2ccccc2)c2ccccc12
: